[jitsi-cc] Jitsi Meet Torture Compatibility Build # 265 - Still Failing!

Jitsi Jenkins jenkins at jitsi.org
Thu May 26 02:29:58 CEST 2016


jitsi-meet-torture-nightly - Build # 265 - Still Failing

Started by timer

No changes


2 tests failed.
FAILED:  org.jitsi.meet.test.ActiveSpeakerTest.testActiveSpeaker

Error Message:
Timed out after 30 seconds waiting for org.jitsi.meet.test.util.TestUtils$1 at 343f4d3d
Build info: version: '2.53.0', revision: '35ae25b', time: '2016-03-15 16:57:40'
System info: host: 'ip-10-65-188-75', ip: '10.65.188.75', os.name: 'Linux', os.arch: 'amd64', os.version: '4.4.0-22-generic', java.version: '1.8.0_91'
Driver info: org.openqa.selenium.chrome.ChromeDriver
Capabilities [{applicationCacheEnabled=false, rotatable=false, mobileEmulationEnabled=false, chrome={chromedriverVersion=2.21.371461 (633e689b520b25f3e264a2ede6b74ccc23cb636a), userDataDir=/tmp/.com.google.Chrome.rs5VUS}, takesHeapSnapshot=true, databaseEnabled=false, handlesAlerts=true, hasTouchScreen=false, version=52.0.2739.0, platform=LINUX, browserConnectionEnabled=false, nativeEvents=true, acceptSslCerts=true, locationContextEnabled=true, webStorageEnabled=true, browserName=chrome, takesScreenshot=true, javascriptEnabled=true, cssSelectorsEnabled=true}]
Session ID: fa6850401da68a4501fe87e4512193ed

Stack Trace:
org.openqa.selenium.TimeoutException: Timed out after 30 seconds waiting for org.jitsi.meet.test.util.TestUtils$1 at 343f4d3d
Build info: version: '2.53.0', revision: '35ae25b', time: '2016-03-15 16:57:40'
System info: host: 'ip-10-65-188-75', ip: '10.65.188.75', os.name: 'Linux', os.arch: 'amd64', os.version: '4.4.0-22-generic', java.version: '1.8.0_91'
Driver info: org.openqa.selenium.chrome.ChromeDriver
Capabilities [{applicationCacheEnabled=false, rotatable=false, mobileEmulationEnabled=false, chrome={chromedriverVersion=2.21.371461 (633e689b520b25f3e264a2ede6b74ccc23cb636a), userDataDir=/tmp/.com.google.Chrome.rs5VUS}, takesHeapSnapshot=true, databaseEnabled=false, handlesAlerts=true, hasTouchScreen=false, version=52.0.2739.0, platform=LINUX, browserConnectionEnabled=false, nativeEvents=true, acceptSslCerts=true, locationContextEnabled=true, webStorageEnabled=true, browserName=chrome, takesScreenshot=true, javascriptEnabled=true, cssSelectorsEnabled=true}]
Session ID: fa6850401da68a4501fe87e4512193ed
	at org.openqa.selenium.support.ui.WebDriverWait.timeoutException(WebDriverWait.java:80)
	at org.openqa.selenium.support.ui.FluentWait.until(FluentWait.java:261)
	at org.jitsi.meet.test.util.TestUtils.waitForBoolean(TestUtils.java:75)
	at org.jitsi.meet.test.util.MeetUtils.waitForIceConnected(MeetUtils.java:286)
	at org.jitsi.meet.test.util.MeetUtils.waitForIceConnected(MeetUtils.java:275)
	at org.jitsi.meet.test.ConferenceFixture.waitForThirdParticipantToConnect(ConferenceFixture.java:851)
	at org.jitsi.meet.test.ConferenceFixture.ensureThreeParticipants(ConferenceFixture.java:878)
	at org.jitsi.meet.test.ActiveSpeakerTest.testActiveSpeaker(ActiveSpeakerTest.java:72)


FAILED:  org.jitsi.meet.test.DisplayNameTest.testChangingDisplayName

Error Message:
Display name not visible

Stack Trace:
junit.framework.AssertionFailedError: Display name not visible
	at org.jitsi.meet.test.DisplayNameTest.checkRemoteVideoForName(DisplayNameTest.java:123)
	at org.jitsi.meet.test.DisplayNameTest.checkForDefaultDisplayNames(DisplayNameTest.java:88)
	at org.jitsi.meet.test.DisplayNameTest.checkDisplayNameChange(DisplayNameTest.java:66)
	at org.jitsi.meet.test.DisplayNameTest.testChangingDisplayName(DisplayNameTest.java:51)



-------------- next part --------------
An HTML attachment was scrubbed...
URL: <http://lists.jitsi.org/pipermail/cruisecontrol/attachments/20160526/3a4daf0a/attachment-0006.html>
-------------- next part --------------
An HTML attachment was scrubbed...
URL: <http://lists.jitsi.org/pipermail/cruisecontrol/attachments/20160526/3a4daf0a/attachment-0007.html>
-------------- next part --------------
An HTML attachment was scrubbed...
URL: <http://lists.jitsi.org/pipermail/cruisecontrol/attachments/20160526/3a4daf0a/attachment-0008.html>
-------------- next part --------------
An HTML attachment was scrubbed...
URL: <http://lists.jitsi.org/pipermail/cruisecontrol/attachments/20160526/3a4daf0a/attachment-0009.html>
-------------- next part --------------
An HTML attachment was scrubbed...
URL: <http://lists.jitsi.org/pipermail/cruisecontrol/attachments/20160526/3a4daf0a/attachment-0010.html>
-------------- next part --------------
An HTML attachment was scrubbed...
URL: <http://lists.jitsi.org/pipermail/cruisecontrol/attachments/20160526/3a4daf0a/attachment-0011.html>
-------------- next part --------------
A non-text attachment was scrubbed...
Name: org.jitsi.meet.test.ActiveSpeakerTest.testActiveSpeaker-owner.png
Type: application/octet-stream
Size: 51021 bytes
Desc: not available
URL: <http://lists.jitsi.org/pipermail/cruisecontrol/attachments/20160526/3a4daf0a/attachment-0006.obj>
-------------- next part --------------
A non-text attachment was scrubbed...
Name: org.jitsi.meet.test.ActiveSpeakerTest.testActiveSpeaker-participant.png
Type: application/octet-stream
Size: 30564 bytes
Desc: not available
URL: <http://lists.jitsi.org/pipermail/cruisecontrol/attachments/20160526/3a4daf0a/attachment-0007.obj>
-------------- next part --------------
A non-text attachment was scrubbed...
Name: org.jitsi.meet.test.ActiveSpeakerTest.testActiveSpeaker-third.png
Type: application/octet-stream
Size: 56173 bytes
Desc: not available
URL: <http://lists.jitsi.org/pipermail/cruisecontrol/attachments/20160526/3a4daf0a/attachment-0008.obj>
-------------- next part --------------
A non-text attachment was scrubbed...
Name: org.jitsi.meet.test.DisplayNameTest.testChangingDisplayName-owner.png
Type: application/octet-stream
Size: 42946 bytes
Desc: not available
URL: <http://lists.jitsi.org/pipermail/cruisecontrol/attachments/20160526/3a4daf0a/attachment-0009.obj>
-------------- next part --------------
A non-text attachment was scrubbed...
Name: org.jitsi.meet.test.DisplayNameTest.testChangingDisplayName-participant.png
Type: application/octet-stream
Size: 49207 bytes
Desc: not available
URL: <http://lists.jitsi.org/pipermail/cruisecontrol/attachments/20160526/3a4daf0a/attachment-0010.obj>
-------------- next part --------------
A non-text attachment was scrubbed...
Name: org.jitsi.meet.test.DisplayNameTest.testChangingDisplayName-third.png
Type: application/octet-stream
Size: 3582 bytes
Desc: not available
URL: <http://lists.jitsi.org/pipermail/cruisecontrol/attachments/20160526/3a4daf0a/attachment-0011.obj>


More information about the cruisecontrol mailing list